Reaction Details
TargetCarbonic anhydrase 9
LigandBDBM50239278
Substrate/Competitorn/a
Meas. Tech.ChEMBL_1665870 (CHEMBL4015666)
Ki 39±n/a nM
Citation Bruno, EBuemi, MRDi Fiore, ADe Luca, LFerro, SAngeli, ACirilli, RSadutto, DAlterio, VMonti, SMSupuran, CTDe Simone, GGitto, R Probing Molecular Interactions between Human Carbonic Anhydrases (hCAs) and a Novel Class of Benzenesulfonamides. J Med Chem60:4316-4326 (2017) 
 
Carbonic anhydrase 9
Name:Carbonic anhydrase 9
Type:Enzyme
Mol. Mass.:49669.03
Organism:Homo sapiens (Human)
Description:Catalytic domain of human cloned isozyme was used in the assay
Residue:459
BDBM50239278
NameBDBM50239278
Synonyms:CHEMBL4095957
TypeSmall organic molecule
Emp. Form.C22H20N2O5S
Mol. Mass.424.47
SMILESNS(=O)(=O)c1ccc(cc1)C(=O)N1CCc2cc(O)c(O)cc2[C@@H]1c1ccccc1