Reaction Details
TargetCarbonic anhydrase 12
LigandBDBM50239277
Substrate/Competitorn/a
Meas. Tech.ChEMBL_1665871 (CHEMBL4015667)
Ki 7.6±n/a nM
Citation Bruno, EBuemi, MRDi Fiore, ADe Luca, LFerro, SAngeli, ACirilli, RSadutto, DAlterio, VMonti, SMSupuran, CTDe Simone, GGitto, R Probing Molecular Interactions between Human Carbonic Anhydrases (hCAs) and a Novel Class of Benzenesulfonamides. J Med Chem60:4316-4326 (2017) 
 
Carbonic anhydrase 12
Name:Carbonic anhydrase 12
Type:Enzyme
Mol. Mass.:39456.00
Organism:Homo sapiens (Human)
Description:Catalytic domain of human cloned isozyme was used in the assay
Residue:354
BDBM50239277
NameBDBM50239277
Synonyms:CHEMBL4081248
TypeSmall organic molecule
Emp. Form.C22H19ClN2O5S
Mol. Mass.458.915
SMILESNS(=O)(=O)c1ccc(cc1)C(=O)N1CCc2cc(O)c(O)cc2C1c1ccc(Cl)cc1