Reaction Details
TargetCarbonic anhydrase 14
LigandBDBM50239272
Substrate/Competitorn/a
Meas. Tech.ChEMBL_1665872 (CHEMBL4015668)
Ki 325±n/a nM
Citation Bruno, EBuemi, MRDi Fiore, ADe Luca, LFerro, SAngeli, ACirilli, RSadutto, DAlterio, VMonti, SMSupuran, CTDe Simone, GGitto, R Probing Molecular Interactions between Human Carbonic Anhydrases (hCAs) and a Novel Class of Benzenesulfonamides. J Med Chem60:4316-4326 (2017) 
 
Carbonic anhydrase 14
Name:Carbonic anhydrase 14
Type:Enzyme
Mol. Mass.:37665.67
Organism:Homo sapiens (Human)
Description:Human (cloned) isozyme.
Residue:337
BDBM50239272
NameBDBM50239272
Synonyms:CHEMBL4098299
TypeSmall organic molecule
Emp. Form.C24H23ClN2O5S
Mol. Mass.486.968
SMILESCOc1cc2CCN(C(c3ccc(Cl)cc3)c2cc1OC)C(=O)c1ccc(cc1)S(N)(=O)=O