Reaction Details
TargetCarbonic anhydrase 14
LigandBDBM50239274
Substrate/Competitorn/a
Meas. Tech.ChEMBL_1665872 (CHEMBL4015668)
Ki 6.3±n/a nM
Citation Bruno, EBuemi, MRDi Fiore, ADe Luca, LFerro, SAngeli, ACirilli, RSadutto, DAlterio, VMonti, SMSupuran, CTDe Simone, GGitto, R Probing Molecular Interactions between Human Carbonic Anhydrases (hCAs) and a Novel Class of Benzenesulfonamides. J Med Chem60:4316-4326 (2017) 
 
Carbonic anhydrase 14
Name:Carbonic anhydrase 14
Type:Enzyme
Mol. Mass.:37665.67
Organism:Homo sapiens (Human)
Description:Human (cloned) isozyme.
Residue:337
BDBM50239274
NameBDBM50239274
Synonyms:CHEMBL4079453
TypeSmall organic molecule
Emp. Form.C22H20N2O4S
Mol. Mass.408.47
SMILESNS(=O)(=O)c1ccc(cc1)C(=O)N1CCc2cc(O)ccc2C1c1ccccc1