Reaction Details
TargetDNA (cytosine-5)-methyltransferase 1
LigandBDBM50239285
Substrate/Competitorn/a
Meas. Tech.ChEMBL_1665873 (CHEMBL4015669)
EC50 24000±n/a nM
Citation Halby, LMenon, YRilova, EPechalrieu, DMasson, VFaux, CBouhlel, MADavid-Cordonnier, MHNovosad, NAussagues, YSamson, ALacroix, LAusseil, FFleury, LGuianvarc'h, DFerroud, CArimondo, PB Rational Design of Bisubstrate-Type Analogues as Inhibitors of DNA Methyltransferases in Cancer Cells. J Med Chem60:4665-4679 (2017) 
 
DNA (cytosine-5)-methyltransferase 1
Name:DNA (cytosine-5)-methyltransferase 1
Type:Enzyme
Mol. Mass.:183184.85
Organism:Homo sapiens (Human)
Description:P26358
Residue:1616
BDBM50239285
NameBDBM50239285
Synonyms:CHEMBL4096869
TypeSmall organic molecule
Emp. Form.C35H40N6O
Mol. Mass.560.7317
SMILESCc1cc(NCCN2CCC(COc3ccc4c(NCCCc5ccccc5)ncnc4c3)CC2)c2ccccc2n1