Reaction Details
TargetDNA (cytosine-5)-methyltransferase 1
LigandBDBM50239291
Substrate/Competitorn/a
Meas. Tech.ChEMBL_1665873 (CHEMBL4015669)
EC50 20000±n/a nM
Citation Halby, LMenon, YRilova, EPechalrieu, DMasson, VFaux, CBouhlel, MADavid-Cordonnier, MHNovosad, NAussagues, YSamson, ALacroix, LAusseil, FFleury, LGuianvarc'h, DFerroud, CArimondo, PB Rational Design of Bisubstrate-Type Analogues as Inhibitors of DNA Methyltransferases in Cancer Cells. J Med Chem60:4665-4679 (2017) 
 
DNA (cytosine-5)-methyltransferase 1
Name:DNA (cytosine-5)-methyltransferase 1
Type:Enzyme
Mol. Mass.:183184.85
Organism:Homo sapiens (Human)
Description:P26358
Residue:1616
BDBM50239291
NameBDBM50239291
Synonyms:CHEMBL4091463
TypeSmall organic molecule
Emp. Form.C37H39N7O
Mol. Mass.597.7519
SMILESC(CNc1ncnc2cc(OCC3CCN(CCNc4ccnc5ccccc45)CC3)ccc12)Nc1cccc2ccccc12