Reaction Details
TargetVoltage-dependent L-type calcium channel subunit alpha-1S
LigandBDBM50000362
Substrate/Competitorn/a
Meas. Tech.ChEBML_53192
Kd 12000±n/a nM
Citation Kimball, SDFloyd, DMDas, JHunt, JTKrapcho, JRovnyak, GDuff, KJLee, VGMoquin, RVTurk, CF Benzazepinone calcium channel blockers. 4. Structure-activity overview and intracellular binding site. J Med Chem35:780-93 (1992) Voltage-dependent L-type calcium channel subunit alpha-1S
Name:Voltage-dependent L-type calcium channel subunit alpha-1S
Type:PROTEIN
Mol. Mass.:212348.33
Organism:Homo sapiens (Human)
Description:ChEMBL_42767
Residue:1873
BDBM50000362
NameBDBM50000362
Synonyms:Acetic acid 1-(2-dimethylamino-ethyl)-4-(4-methoxy-phenyl)-7-methylcarbamoyloxy-2-oxo-2,3,4,5-tetrahydro-1H-benzo[b]azepin-3-yl ester | CHEMBL349140
TypeSmall organic molecule
Emp. Form.C25H31N3O6
Mol. Mass.469.5301
SMILESCNC(=O)Oc1ccc2N(CCN(C)C)C(=O)[C@H](OC(C)=O)[C@@H](Cc2c1)c1ccc(OC)cc1