Reaction Details
TargetVoltage-dependent L-type calcium channel subunit alpha-1S
LigandBDBM50000383
Substrate/Competitorn/a
Meas. Tech.ChEBML_53192
Kd 650±n/a nM
Citation Kimball, SDFloyd, DMDas, JHunt, JTKrapcho, JRovnyak, GDuff, KJLee, VGMoquin, RVTurk, CF Benzazepinone calcium channel blockers. 4. Structure-activity overview and intracellular binding site. J Med Chem35:780-93 (1992) Voltage-dependent L-type calcium channel subunit alpha-1S
Name:Voltage-dependent L-type calcium channel subunit alpha-1S
Type:PROTEIN
Mol. Mass.:212348.33
Organism:Homo sapiens (Human)
Description:ChEMBL_42767
Residue:1873
BDBM50000383
NameBDBM50000383
Synonyms:(3R,4R)-1-(2-Dimethylamino-ethyl)-4-(4-methoxy-phenyl)-3-methyl-1,3,4,5-tetrahydro-benzo[b]azepin-2-one CHEMBL98189
TypeSmall organic molecule
Emp. Form.C22H28N2O2
Mol. Mass.352.4699
SMILESCOc1ccc(cc1)[C@@H]1Cc2ccccc2N(CCN(C)C)C(=O)[C@@H]1C