Reaction Details
TargetVoltage-dependent L-type calcium channel subunit alpha-1S
LigandBDBM50000359
Substrate/Competitorn/a
Meas. Tech.ChEMBL_53192 (CHEMBL666571)
Kd 540±n/a nM
Citation Kimball, SDFloyd, DMDas, JHunt, JTKrapcho, JRovnyak, GDuff, KJLee, VGMoquin, RVTurk, CF Benzazepinone calcium channel blockers. 4. Structure-activity overview and intracellular binding site. J Med Chem35:780-93 (1992) Voltage-dependent L-type calcium channel subunit alpha-1S
Name:Voltage-dependent L-type calcium channel subunit alpha-1S
Type:PROTEIN
Mol. Mass.:212348.33
Organism:Homo sapiens (Human)
Description:ChEMBL_42767
Residue:1873
BDBM50000359
NameBDBM50000359
Synonyms:1-(2-Dimethylamino-1-methyl-ethyl)-4-(4-methoxy-phenyl)-3-methyl-6-trifluoromethyl-1,3,4,5-tetrahydro-benzo[b]azepin-2-one | CHEMBL167987
TypeSmall organic molecule
Emp. Form.C24H29F3N2O2
Mol. Mass.434.4945
SMILESCOc1ccc(cc1)[C@@H]1Cc2c(cccc2C(F)(F)F)N(C(C)CN(C)C)C(=O)[C@@H]1C