Reaction Details
TargetLymphocyte antigen 96
LigandBDBM50239340
Substrate/Competitorn/a
Meas. Tech.ChEMBL_1665929 (CHEMBL4015725)
IC50 700±n/a nM
Citation Sestito, SEFacchini, FAMorbioli, IBillod, JMMartin-Santamaria, SCasnati, ASansone, FPeri, F Amphiphilic Guanidinocalixarenes Inhibit Lipopolysaccharide (LPS)- and Lectin-Stimulated Toll-like Receptor 4 (TLR4) Signaling. J Med Chem60:4882-4892 (2017) 
 
Lymphocyte antigen 96
Name:Lymphocyte antigen 96
Type:PROTEIN
Mol. Mass.:18551.39
Organism:Homo sapiens (Human)
Description:ChEMBL_107939
Residue:160
BDBM50239340
NameBDBM50239340
Synonyms:CHEMBL4081306
TypeSmall organic molecule
Emp. Form.C41H58Cl4N12O3
Mol. Mass.908.79
SMILESCl.Cl.Cl.Cl.CCCOc1c2Cc3cc(Cc4cc(NC(N)=N)cc(Cc5cc(NC(N)=N)cc(Cc1cc(NC(N)=N)c2)c5OCCC)c4OCCC)cc(NC(N)=N)c3