Reaction Details
TargetPhosphatidylinositol 4,5-bisphosphate 3-kinase catalytic subunit delta isoform
LigandBDBM50323726
Substrate/Competitorn/a
Meas. Tech.ChEMBL_1666008 (CHEMBL4015804)
IC50 25.1±n/a nM
Citation Lodola, ABertolini, SBiagetti, MCapacchi, SFacchinetti, FGallo, PMPappani, AMor, MPala, DRivara, SVisentini, FCorsi, MCapelli, AM Atropisomerism and Conformational Equilibria: Impact on PI3K? Inhibition of 2-((6-Amino-9H-purin-9-yl)methyl)-5-methyl-3-(o-tolyl)quinazolin-4(3H)-one (IC87114) and Its Conformationally Restricted Analogs. J Med Chem60:4304-4315 (2017) 
 
Phosphatidylinositol 4,5-bisphosphate 3-kinase catalytic subunit delta isoform
Name:Phosphatidylinositol 4,5-bisphosphate 3-kinase catalytic subunit delta isoform
Type:Enzyme Subunit
Mol. Mass.:119489.41
Organism:Homo sapiens (Human)
Description:O00329
Residue:1044
BDBM50323726
NameBDBM50323726
Synonyms:2-((6-amino-9H-purin-9-yl)methyl)-5-methyl-3-o-tolylquinazolin-4(3H)-one | CHEMBL1213082
TypeSmall organic molecule
Emp. Form.C22H19N7O
Mol. Mass.397.4326
SMILESCc1ccccc1-n1c(Cn2cnc3c(N)ncnc23)nc2cccc(C)c2c1=O