Reaction Details
TargetPhosphatidylinositol 4,5-bisphosphate 3-kinase catalytic subunit delta isoform
LigandBDBM50239399
Substrate/Competitorn/a
Meas. Tech.ChEMBL_1666008 (CHEMBL4015804)
IC50 6.31±n/a nM
Citation Lodola, ABertolini, SBiagetti, MCapacchi, SFacchinetti, FGallo, PMPappani, AMor, MPala, DRivara, SVisentini, FCorsi, MCapelli, AM Atropisomerism and Conformational Equilibria: Impact on PI3K? Inhibition of 2-((6-Amino-9H-purin-9-yl)methyl)-5-methyl-3-(o-tolyl)quinazolin-4(3H)-one (IC87114) and Its Conformationally Restricted Analogs. J Med Chem60:4304-4315 (2017) 
 
Phosphatidylinositol 4,5-bisphosphate 3-kinase catalytic subunit delta isoform
Name:Phosphatidylinositol 4,5-bisphosphate 3-kinase catalytic subunit delta isoform
Type:Enzyme Subunit
Mol. Mass.:119489.41
Organism:Homo sapiens (Human)
Description:O00329
Residue:1044
BDBM50239399
NameBDBM50239399
Synonyms:CHEMBL4069027
TypeSmall organic molecule
Emp. Form.C23H21N7O
Mol. Mass.411.4591
SMILESC[C@@H](c1nc2cccc(C)c2c(=O)n1-c1ccccc1C)n1cnc2c(N)ncnc12