Reaction Details
TargetInterleukin-1 receptor-associated kinase 4
LigandBDBM50239489
Substrate/Competitorn/a
Meas. Tech.ChEMBL_1666148 (CHEMBL4015944)
IC50 7.6±n/a nM
Citation Lee, KLAmbler, CMAnderson, DRBoscoe, BPBree, AGBrodfuehrer, JIChang, JSChoi, CChung, SCurran, KJDay, JEDehnhardt, CMDower, KDrozda, SEFrisbie, RKGavrin, LKGoldberg, JAHan, SHegen, MHepworth, DHope, HRKamtekar, SKilty, ICLee, ALin, LLLovering, FELowe, MDMathias, JPMorgan, HMMurphy, EAPapaioannou, NPatny, APierce, BSRao, VRSaiah, ESamardjiev, IJSamas, BMShen, MWHShin, JHSoutter, HHStrohbach, JWSymanowicz, PTThomason, JRTrzupek, JDVargas, RVincent, FYan, JZapf, CWWright, SW Discovery of Clinical Candidate 1-{[(2S,3S,4S)-3-Ethyl-4-fluoro-5-oxopyrrolidin-2-yl]methoxy}-7-methoxyisoquinoline-6-carboxamide (PF-06650833), a Potent, Selective Inhibitor of Interleukin-1 Receptor Associated Kinase 4 (IRAK4), by Fragment-Based Drug Design. J Med Chem60:5521-5542 (2017) 
 
Interleukin-1 receptor-associated kinase 4
Name:Interleukin-1 receptor-associated kinase 4
Type:Protein
Mol. Mass.:51519.08
Organism:Homo sapiens (Human)
Description:Q9NWZ3
Residue:460
BDBM50239489
NameBDBM50239489
Synonyms:CHEMBL4100091 US10793579, Example 122 | US11702424, Example 121
TypeSmall organic molecule
Emp. Form.C16H17N3O4
Mol. Mass.315.3239
SMILESCOc1cc2c(OC[C@@H]3CCC(=O)N3)nccc2cc1C(N)=O