Reaction Details
TargetdCTP pyrophosphatase 1
LigandBDBM50239517
Substrate/Competitorn/a
Meas. Tech.ChEMBL_1666223 (CHEMBL4016019)
IC50 25±n/a nM
Citation Llona-Minguez, SHöglund, AGhassemian, ADesroses, MCalderón-Montaño, JMBurgos Morón, EValerie, NCKWiita, EAlmlöf, IKoolmeister, TMateus, ACazares-Körner, CSanjiv, KHoman, ELoseva, OBaranczewski, PDarabi, MMehdizadeh, AFayezi, SJemth, ASWarpman Berglund, USigmundsson, KLundbäck, TJenmalm Jensen, AArtursson, PScobie, MHelleday, T Piperazin-1-ylpyridazine Derivatives Are a Novel Class of Human dCTP Pyrophosphatase 1 Inhibitors. J Med Chem60:4279-4292 (2017) 
 
dCTP pyrophosphatase 1
Name:dCTP pyrophosphatase 1
Type:Protein
Mol. Mass.:18673.58
Organism:Homo sapiens (Human)
Description:Q9H773
Residue:170
BDBM50239517
NameBDBM50239517
Synonyms:CHEMBL4082508
TypeSmall organic molecule
Emp. Form.C21H20ClFN6O3S
Mol. Mass.490.938
SMILESFc1ccc(CNC(=O)c2ccc(nn2)N2CCN(CC2)S(=O)(=O)c2cccnc2Cl)cc1