Reaction Details
TargetdCTP pyrophosphatase 1
LigandBDBM50239518
Substrate/Competitorn/a
Meas. Tech.ChEMBL_1666223 (CHEMBL4016019)
IC50 36±n/a nM
Citation Llona-Minguez, SHöglund, AGhassemian, ADesroses, MCalderón-Montaño, JMBurgos Morón, EValerie, NCKWiita, EAlmlöf, IKoolmeister, TMateus, ACazares-Körner, CSanjiv, KHoman, ELoseva, OBaranczewski, PDarabi, MMehdizadeh, AFayezi, SJemth, ASWarpman Berglund, USigmundsson, KLundbäck, TJenmalm Jensen, AArtursson, PScobie, MHelleday, T Piperazin-1-ylpyridazine Derivatives Are a Novel Class of Human dCTP Pyrophosphatase 1 Inhibitors. J Med Chem60:4279-4292 (2017) 
 
dCTP pyrophosphatase 1
Name:dCTP pyrophosphatase 1
Type:Protein
Mol. Mass.:18673.58
Organism:Homo sapiens (Human)
Description:Q9H773
Residue:170
BDBM50239518
NameBDBM50239518
Synonyms:CHEMBL4075978
TypeSmall organic molecule
Emp. Form.C22H23FN6O3S
Mol. Mass.470.52
SMILESCc1ncccc1S(=O)(=O)N1CCN(CC1)c1ccc(nn1)C(=O)NCc1ccc(F)cc1