Reaction Details
TargetPhosphatidylinositol 4,5-bisphosphate 3-kinase catalytic subunit delta isoform
LigandBDBM50239548
Substrate/Competitorn/a
Meas. Tech.ChEMBL_1666332 (CHEMBL4016128)
IC50 2.5±n/a nM
Citation Perry, MWDBjörhall, KBonn, BCarlsson, JChen, YEriksson, AFredlund, LHao, HHolden, NSKarabelas, KLindmark, HLiu, FPemberton, NPetersen, JRodrigo Blomqvist, SSmith, RWSvensson, TTerstiege, ITyrchan, CYang, WZhao, SÖster, L Design and Synthesis of Soluble and Cell-Permeable PI3K? Inhibitors for Long-Acting Inhaled Administration. J Med Chem60:5057-5071 (2017) 
 
Phosphatidylinositol 4,5-bisphosphate 3-kinase catalytic subunit delta isoform
Name:Phosphatidylinositol 4,5-bisphosphate 3-kinase catalytic subunit delta isoform
Type:Enzyme Subunit
Mol. Mass.:119489.41
Organism:Homo sapiens (Human)
Description:O00329
Residue:1044
BDBM50239548
NameBDBM50239548
Synonyms:CHEMBL4080523
TypeSmall organic molecule
Emp. Form.C26H29N7O2S
Mol. Mass.503.619
SMILESCOCCNCc1cccc(Cc2c(cc3scc(C)n3c2=O)[C@H](C)Nc2ncnc(N)c2C#N)c1