Reaction Details
TargetPhosphatidylinositol 3-kinase regulatory subunit alpha/4,5-bisphosphate 3-kinase catalytic subunit beta isoform
LigandBDBM50239551
Substrate/Competitorn/a
Meas. Tech.ChEMBL_1666330 (CHEMBL4016126)
IC50 20±n/a nM
Citation Perry, MWDBjörhall, KBonn, BCarlsson, JChen, YEriksson, AFredlund, LHao, HHolden, NSKarabelas, KLindmark, HLiu, FPemberton, NPetersen, JRodrigo Blomqvist, SSmith, RWSvensson, TTerstiege, ITyrchan, CYang, WZhao, SÖster, L Design and Synthesis of Soluble and Cell-Permeable PI3K? Inhibitors for Long-Acting Inhaled Administration. J Med Chem60:5057-5071 (2017) 
 
Phosphatidylinositol 3-kinase regulatory subunit alpha/4,5-bisphosphate 3-kinase catalytic subunit beta isoform
Name:Phosphatidylinositol 3-kinase regulatory subunit alpha/4,5-bisphosphate 3-kinase catalytic subunit beta isoform
Type:Protein
Mol. Mass.:n/a
Description:n/a
Components:This complex has 2 components.
Component 1
Name:Phosphatidylinositol 4,5-bisphosphate 3-kinase catalytic subunit beta isoform
Synonyms:PI3-kinase p110 subunit beta PI3Kbeta PIK3CB Phosphatidylinositol 4,5-bisphosphate 3-kinase catalytic subunit beta (PI3Kbeta) Phosphatidylinositol 4,5-bisphosphate 3-kinase catalytic subunit beta isoform (PI3K) Phosphatidylinositol 4,5-bisphosphate 3-kinase catalytic subunit beta isoform (PI3Kbeta) Phosphatidylinositol-4,5-bisphosphate 3-kinase catalytic subunit beta isoform Phosphoinositide 3-Kinase (PI3K), beta Chain A PtdIns-3-kinase p110
Type:Enzyme Subunit
Mol. Mass.:122769.00
Organism:Homo sapiens (Human)
Description:P42338
Residue:1070
Component 2
Name:Phosphatidylinositol 3-kinase regulatory subunit alpha
Synonyms:GRB1 PI3-kinase class I PI3-kinase p85-alpha subunit PI3-kinase subunit p85-alpha PIK3CG/PIK3R1 Phosphatidylinositol 3-kinase 85 kDa regulatory subunit alpha (PI3K alpha) Phosphatidylinositol 3-kinase regulatory subunit alpha (PIK3R1) Phosphatidylinositol 3-kinase regulatory subunit alpha isoform 1 (PI3 Kinase alpha) Phosphatidylinositol 4,5-bisphosphate 3-kinase catalytic subunit alpha isoform (PI3Kalpha) PtdIns-3-kinase p85-alpha p85 alpha
Type:Protein
Mol. Mass.:83592.82
Organism:Homo sapiens (Human)
Description:P27986
Residue:724
BDBM50239551
NameBDBM50239551
Synonyms:CHEMBL4091365
TypeSmall organic molecule
Emp. Form.C28H32N8O2S
Mol. Mass.544.671
SMILESC[C@H](Nc1ncnc(N)c1C#N)c1cc2scc(C)n2c(=O)c1-c1cccc(CNCCN2CCOCC2)c1