Reaction Details
TargetKappa-type opioid receptor
LigandBDBM50000572
Substrate/Competitorn/a
Meas. Tech.ChEMBL_145994 (CHEMBL750588)
Ki>500±n/a nM
Citation Froimowitz, MPick, CGPasternak, GW Phenylmorphans and analogues: opioid receptor subtype selectivity and effect of conformation on activity. J Med Chem35:1521-5 (1992) Kappa-type opioid receptor
Name:Kappa-type opioid receptor
Type:G Protein-Coupled Receptor (GPCR)
Mol. Mass.:42648.76
Organism:Homo sapiens (Human)
Description:P41145
Residue:380
BDBM50000572
NameBDBM50000572
Synonyms:5-(3-Hydroxy-phenyl)-2-methyl-2-aza-bicyclo[3.3.1]nonan-9-ol | CHEMBL36707
TypeSmall organic molecule
Emp. Form.C15H21NO2
Mol. Mass.247.3327
SMILESCN1CCC2(CCCC1[C@@H]2O)c1cccc(O)c1