Reaction Details
TargetKappa-type opioid receptor
LigandBDBM50000570
Substrate/Competitorn/a
Meas. Tech.ChEMBL_146511 (CHEMBL754620)
Ki 98.0±n/a nM
Citation Froimowitz, MPick, CGPasternak, GW Phenylmorphans and analogues: opioid receptor subtype selectivity and effect of conformation on activity. J Med Chem35:1521-5 (1992) Kappa-type opioid receptor
Name:Kappa-type opioid receptor
Type:G Protein-Coupled Receptor (GPCR)
Mol. Mass.:42744.99
Organism:Cavia porcellus (domestic guinea pig)
Description:P41144
Residue:380
BDBM50000570
NameBDBM50000570
Synonyms:3-(2-Methyl-2-aza-bicyclo[3.3.1]non-5-yl)-phenol | CHEMBL285250
TypeSmall organic molecule
Emp. Form.C15H21NO
Mol. Mass.231.3333
SMILESCN1CCC2(CCCC1C2)c1cccc(O)c1