Reaction Details
TargetBromodomain testis-specific protein
LigandBDBM50239572
Substrate/Competitorn/a
Meas. Tech.ChEBML_1666425
Ki>40000±n/a nM
Citation Ayoub, AMHawk, LMLHerzig, RJJiang, JWisniewski, AJGee, CTZhao, PZhu, JYBerndt, NOffei-Addo, NKScott, TGQi, JBradner, JEWard, TRSchönbrunn, EGeorg, GIPomerantz, WCK BET Bromodomain Inhibitors with One-Step Synthesis Discovered from Virtual Screen. J Med Chem60:4805-4817 (2017) 
 
Bromodomain testis-specific protein
Name:Bromodomain testis-specific protein
Type:PROTEIN
Mol. Mass.:107982.01
Organism:Homo sapiens (Human)
Description:ChEMBL_1502985
Residue:947
BDBM50239572
NameBDBM50239572
Synonyms:CHEMBL4060512
TypeSmall organic molecule
Emp. Form.C18H17N3O4
Mol. Mass.339.3453
SMILESCc1ccc(cc1)C1C2=C(COC2=O)Nc2c1c(=O)n(C)c(=O)n2C