Reaction Details
TargetBromodomain-containing protein 4
LigandBDBM50239586
Substrate/Competitorn/a
Meas. Tech.ChEMBL_1666426 (CHEMBL4016222)
Ki 160±n/a nM
Citation Ayoub, AMHawk, LMLHerzig, RJJiang, JWisniewski, AJGee, CTZhao, PZhu, JYBerndt, NOffei-Addo, NKScott, TGQi, JBradner, JEWard, TRSchönbrunn, EGeorg, GIPomerantz, WCK BET Bromodomain Inhibitors with One-Step Synthesis Discovered from Virtual Screen. J Med Chem60:4805-4817 (2017) 
 
Bromodomain-containing protein 4
Name:Bromodomain-containing protein 4
Type:Protein
Mol. Mass.:152264.84
Organism:Homo sapiens (Human)
Description:O60885
Residue:1362
BDBM50239586
NameBDBM50239586
Synonyms:CHEMBL4072799
TypeSmall organic molecule
Emp. Form.C18H14F3N3O4
Mol. Mass.393.3167
SMILESCc1ccc(cc1)C1C2=C(COC2=O)Nc2c1c(=O)[nH]c(=O)n2CC(F)(F)F