Reaction Details
TargetBromodomain-containing protein 4
LigandBDBM50239568
Substrate/Competitorn/a
Meas. Tech.ChEMBL_1666426 (CHEMBL4016222)
Ki 140±n/a nM
Citation Ayoub, AMHawk, LMLHerzig, RJJiang, JWisniewski, AJGee, CTZhao, PZhu, JYBerndt, NOffei-Addo, NKScott, TGQi, JBradner, JEWard, TRSchönbrunn, EGeorg, GIPomerantz, WCK BET Bromodomain Inhibitors with One-Step Synthesis Discovered from Virtual Screen. J Med Chem60:4805-4817 (2017) 
 
Bromodomain-containing protein 4
Name:Bromodomain-containing protein 4
Type:Protein
Mol. Mass.:152264.84
Organism:Homo sapiens (Human)
Description:O60885
Residue:1362
BDBM50239568
NameBDBM50239568
Synonyms:CHEMBL4092949
TypeSmall organic molecule
Emp. Form.C26H26N4O3
Mol. Mass.442.5096
SMILESCCn1c2NC3=C(C(c4ccc(C)cc4)c2c(=O)[nH]c1=O)C(=O)N(CCc1ccccc1)C3