Reaction Details
TargetBromodomain testis-specific protein
LigandBDBM50239587
Substrate/Competitorn/a
Meas. Tech.ChEBML_1666425
Ki>40000±n/a nM
Citation Ayoub, AMHawk, LMLHerzig, RJJiang, JWisniewski, AJGee, CTZhao, PZhu, JYBerndt, NOffei-Addo, NKScott, TGQi, JBradner, JEWard, TRSchönbrunn, EGeorg, GIPomerantz, WCK BET Bromodomain Inhibitors with One-Step Synthesis Discovered from Virtual Screen. J Med Chem60:4805-4817 (2017) 
 
Bromodomain testis-specific protein
Name:Bromodomain testis-specific protein
Type:PROTEIN
Mol. Mass.:107982.01
Organism:Homo sapiens (Human)
Description:ChEMBL_1502985
Residue:947
BDBM50239587
NameBDBM50239587
Synonyms:CHEMBL4067951
TypeSmall organic molecule
Emp. Form.C18H15N3O4
Mol. Mass.337.3294
SMILESCCn1c2nc3COC(=O)c3c(-c3ccc(C)cc3)c2c(=O)[nH]c1=O