Reaction Details
TargetBromodomain-containing protein 4
LigandBDBM50239567
Substrate/Competitorn/a
Meas. Tech.ChEMBL_1666426 (CHEMBL4016222)
Ki 110±n/a nM
Citation Ayoub, AMHawk, LMLHerzig, RJJiang, JWisniewski, AJGee, CTZhao, PZhu, JYBerndt, NOffei-Addo, NKScott, TGQi, JBradner, JEWard, TRSchönbrunn, EGeorg, GIPomerantz, WCK BET Bromodomain Inhibitors with One-Step Synthesis Discovered from Virtual Screen. J Med Chem60:4805-4817 (2017) 
 
Bromodomain-containing protein 4
Name:Bromodomain-containing protein 4
Type:Protein
Mol. Mass.:152264.84
Organism:Homo sapiens (Human)
Description:O60885
Residue:1362
BDBM50239567
NameBDBM50239567
Synonyms:CHEMBL4085204
TypeSmall organic molecule
Emp. Form.C26H26N4O4
Mol. Mass.458.509
SMILESCCn1c2NC3=C(C(c4ccc(C)cc4)c2c(=O)[nH]c1=O)C(=O)N(CCc1ccc(O)cc1)C3