Reaction Details
TargetGlycine hydroxymethyltransferase
LigandBDBM50239644
Substrate/Competitorn/a
Meas. Tech.ChEMBL_1666642 (CHEMBL4016438)
IC50 3760±n/a nM
Citation Schwertz, GWitschel, MCRottmann, MBonnert, RLeartsakulpanich, UChitnumsub, PJaruwat, AIttarat, WSchäfer, AAponte, RACharman, SAWhite, KLKundu, ASadhukhan, SLloyd, MFreiberg, GMSrikumaran, MSiggel, MZwyssig, AChaiyen, PDiederich, F Antimalarial Inhibitors Targeting Serine Hydroxymethyltransferase (SHMT) with in Vivo Efficacy and Analysis of their Binding Mode Based on X-ray Cocrystal Structures. J Med Chem60:4840-4860 (2017) 
 
Glycine hydroxymethyltransferase
Name:Glycine hydroxymethyltransferase
Type:PROTEIN
Mol. Mass.:49787.58
Organism:Plasmodium falciparum
Description:ChEMBL_117520
Residue:442
BDBM50239644
NameBDBM50239644
Synonyms:CHEMBL4082315
TypeSmall organic molecule
Emp. Form.C22H18ClF3N4O2S
Mol. Mass.494.917
SMILESCC(C)C1(c2c(C)[nH]nc2OC(N)=C1C#N)c1cc(OC(F)(F)F)cc(c1)-c1ccc(Cl)s1