Reaction Details
TargetGlycine hydroxymethyltransferase
LigandBDBM50239647
Substrate/Competitorn/a
Meas. Tech.ChEMBL_1666642 (CHEMBL4016438)
IC50 11±n/a nM
Citation Schwertz, GWitschel, MCRottmann, MBonnert, RLeartsakulpanich, UChitnumsub, PJaruwat, AIttarat, WSchäfer, AAponte, RACharman, SAWhite, KLKundu, ASadhukhan, SLloyd, MFreiberg, GMSrikumaran, MSiggel, MZwyssig, AChaiyen, PDiederich, F Antimalarial Inhibitors Targeting Serine Hydroxymethyltransferase (SHMT) with in Vivo Efficacy and Analysis of their Binding Mode Based on X-ray Cocrystal Structures. J Med Chem60:4840-4860 (2017) 
 
Glycine hydroxymethyltransferase
Name:Glycine hydroxymethyltransferase
Type:PROTEIN
Mol. Mass.:49787.58
Organism:Plasmodium falciparum
Description:ChEMBL_117520
Residue:442
BDBM50239647
NameBDBM50239647
Synonyms:CHEMBL4092595
TypeSmall organic molecule
Emp. Form.C24H24F3N5O3S2
Mol. Mass.554.623
SMILES[2H]C([2H])([2H])c1[nH]nc2OC(N)=C(C#N)C(C(C)C)(c12)c1cc(cc(c1)C(F)(F)F)-c1ccc(s1)S(=O)(=O)N(C)C