Reaction Details
TargetGlycine hydroxymethyltransferase
LigandBDBM50239675
Substrate/Competitorn/a
Meas. Tech.ChEMBL_1666642 (CHEMBL4016438)
IC50 186±n/a nM
Citation Schwertz, GWitschel, MCRottmann, MBonnert, RLeartsakulpanich, UChitnumsub, PJaruwat, AIttarat, WSchäfer, AAponte, RACharman, SAWhite, KLKundu, ASadhukhan, SLloyd, MFreiberg, GMSrikumaran, MSiggel, MZwyssig, AChaiyen, PDiederich, F Antimalarial Inhibitors Targeting Serine Hydroxymethyltransferase (SHMT) with in Vivo Efficacy and Analysis of their Binding Mode Based on X-ray Cocrystal Structures. J Med Chem60:4840-4860 (2017) 
 
Glycine hydroxymethyltransferase
Name:Glycine hydroxymethyltransferase
Type:PROTEIN
Mol. Mass.:49787.58
Organism:Plasmodium falciparum
Description:ChEMBL_117520
Residue:442
BDBM50239675
NameBDBM50239675
Synonyms:CHEMBL4095396
TypeSmall organic molecule
Emp. Form.C26H23F3N4O3
Mol. Mass.496.481
SMILESCC(C)C1(c2c(C)[nH]nc2OC(N)=C1C#N)c1cc(cc(c1)C(F)(F)F)-c1cccc(CC(O)=O)c1