Reaction Details
TargetPotassium-transporting ATPase alpha chain 1/subunit beta
LigandBDBM50000677
Substrate/Competitorn/a
Meas. Tech.ChEBML_76253
IC50 220±n/a nM
Citation Leach, CABrown, THIfe, RJKeeling, DJLaing, SMParsons, MEPrice, CAWiggall, KJ Reversible inhibitors of the gastric (H+/K+)-ATPase. 2. 1-Arylpyrrolo[3,2-c]quinolines: effect of the 4-substituent. J Med Chem35:1845-52 (1992) Potassium-transporting ATPase alpha chain 1/subunit beta
Name:Potassium-transporting ATPase alpha chain 1/subunit beta
Synonyms:Potassium-transporting ATPase alpha chain 1/beta chain
Type:n/a
Mol. Mass.:n/a
Description:ASSAY_ID of EBI is 76252
Components:This complex has 2 components.
Component 1
Name:Potassium-transporting ATPase subunit beta
Type:PROTEIN
Mol. Mass.:33694.62
Organism:Rattus norvegicus
Description:EBI_10720
Residue:294
Component 2
Name:Potassium-transporting ATPase alpha chain 1
Synonyms:ATP4A_RAT Hka | Potassium-transporting ATPase
Type:PROTEIN
Mol. Mass.:114028.02
Organism:Rattus norvegicus
Description:EBI_12422
Residue:1033
BDBM50000677
NameBDBM50000677
Synonyms:4-(6-Methyl-1-o-tolyl-1H-pyrrolo[3,2-c]quinolin-4-ylamino)-butan-1-ol | CHEMBL54912
TypeSmall organic molecule
Emp. Form.C23H25N3O
Mol. Mass.359.4641
SMILESCc1ccccc1-n1ccc2c(NCCCCO)nc3c(C)cccc3c12