Reaction Details
TargetPhosphatidylinositol 4,5-bisphosphate 3-kinase catalytic subunit delta isoform
LigandBDBM50239735
Substrate/Competitorn/a
Meas. Tech.ChEMBL_1666747 (CHEMBL4016543)
IC50 31±n/a nM
Citation Liu, QShi, QMarcoux, DBatt, DGCornelius, LQin, LYRuan, ZNeels, JBeaudoin-Bertrand, MSrivastava, ASLi, LCherney, RJGong, HWatterson, SHWeigelt, CGillooly, KMMcIntyre, KWXie, JHObermeier, MTFura, ASleczka, BStefanski, KFancher, RMPadmanabhan, SRp, TKundu, IRajareddy, KSmith, RHennan, JKXing, DFan, JLevesque, PCRuan, QPitt, SZhang, RPedicord, DPan, JYarde, MLu, HLippy, JGoldstine, CSkala, SRampulla, RAMathur, AGupta, AArunachalam, PNSack, JSMuckelbauer, JKCvijic, MESalter-Cid, LMBhide, RSPoss, MAHynes, JCarter, PHMacor, JERuepp, SSchieven, GLTino, JA Identification of a Potent, Selective, and Efficacious Phosphatidylinositol 3-Kinase? (PI3K?) Inhibitor for the Treatment of Immunological Disorders. J Med Chem60:5193-5208 (2017) 
 
Phosphatidylinositol 4,5-bisphosphate 3-kinase catalytic subunit delta isoform
Name:Phosphatidylinositol 4,5-bisphosphate 3-kinase catalytic subunit delta isoform
Type:Enzyme Subunit
Mol. Mass.:119489.41
Organism:Homo sapiens (Human)
Description:O00329
Residue:1044
BDBM50239735
NameBDBM50239735
Synonyms:CHEMBL4102552 | US10214537, Example 626
TypeSmall organic molecule
Emp. Form.C22H25ClN6O3
Mol. Mass.456.925
SMILESCC(O)c1ccc(cc1N1CCN(C(C)=O)C(C)(C)C1=O)-c1cc(Cl)c2c(N)ncnn12