Reaction Details
TargetPhosphatidylinositol 4,5-bisphosphate 3-kinase catalytic subunit delta isoform
LigandBDBM50239718
Substrate/Competitorn/a
Meas. Tech.ChEMBL_1666778 (CHEMBL4016574)
IC50<0.100000±n/a nM
Citation Liu, QShi, QMarcoux, DBatt, DGCornelius, LQin, LYRuan, ZNeels, JBeaudoin-Bertrand, MSrivastava, ASLi, LCherney, RJGong, HWatterson, SHWeigelt, CGillooly, KMMcIntyre, KWXie, JHObermeier, MTFura, ASleczka, BStefanski, KFancher, RMPadmanabhan, SRp, TKundu, IRajareddy, KSmith, RHennan, JKXing, DFan, JLevesque, PCRuan, QPitt, SZhang, RPedicord, DPan, JYarde, MLu, HLippy, JGoldstine, CSkala, SRampulla, RAMathur, AGupta, AArunachalam, PNSack, JSMuckelbauer, JKCvijic, MESalter-Cid, LMBhide, RSPoss, MAHynes, JCarter, PHMacor, JERuepp, SSchieven, GLTino, JA Identification of a Potent, Selective, and Efficacious Phosphatidylinositol 3-Kinase? (PI3K?) Inhibitor for the Treatment of Immunological Disorders. J Med Chem60:5193-5208 (2017) 
 
Phosphatidylinositol 4,5-bisphosphate 3-kinase catalytic subunit delta isoform
Name:Phosphatidylinositol 4,5-bisphosphate 3-kinase catalytic subunit delta isoform
Type:Enzyme Subunit
Mol. Mass.:119489.41
Organism:Homo sapiens (Human)
Description:O00329
Residue:1044
BDBM50239718
NameBDBM50239718
Synonyms:CHEMBL4064666 | US10214537, Example 639
TypeSmall organic molecule
Emp. Form.C22H20F3N7O2
Mol. Mass.471.4351
SMILESCC(=O)N1CCN(C(=O)C1(C)C)c1cc(ccc1C#N)-c1cc(c2c(N)ncnn12)C(F)(F)F