Reaction Details
TargetCytochrome P450 11B1, mitochondrial
LigandBDBM50239792
Substrate/Competitorn/a
Meas. Tech.ChEBML_1667112
IC50 1.000000±n/a nM
Citation Emmerich, Jvan Koppen, CJBurkhart, JLHu, QSiebenbürger, LBoerger, CScheuer, CLaschke, MWMenger, MDHartmann, RW Lead Optimization Generates CYP11B1 Inhibitors of Pyridylmethyl Isoxazole Type with Improved Pharmacological Profile for the Treatment of Cushing's Disease. J Med Chem60:5086-5098 (2017) 
 
Cytochrome P450 11B1, mitochondrial
Name:Cytochrome P450 11B1, mitochondrial
Type:Enzyme
Mol. Mass.:57591.44
Organism:Homo sapiens (Human)
Description:P15538
Residue:503
BDBM50239792
NameBDBM50239792
Synonyms:CHEMBL4068439
TypeSmall organic molecule
Emp. Form.C17H17N3
Mol. Mass.263.337
SMILESCc1cncc(Cc2cc(nn2C)-c2ccccc2)c1