Reaction Details
TargetCytochrome P450 11B1, mitochondrial
LigandBDBM50239814
Substrate/Competitorn/a
Meas. Tech.ChEMBL_1667112 (CHEMBL4016908)
IC50 3±n/a nM
Citation Emmerich, Jvan Koppen, CJBurkhart, JLHu, QSiebenbürger, LBoerger, CScheuer, CLaschke, MWMenger, MDHartmann, RW Lead Optimization Generates CYP11B1 Inhibitors of Pyridylmethyl Isoxazole Type with Improved Pharmacological Profile for the Treatment of Cushing's Disease. J Med Chem60:5086-5098 (2017) 
 
Cytochrome P450 11B1, mitochondrial
Name:Cytochrome P450 11B1, mitochondrial
Type:Enzyme
Mol. Mass.:57591.44
Organism:Homo sapiens (Human)
Description:P15538
Residue:503
BDBM50239814
NameBDBM50239814
Synonyms:CHEMBL4103666
TypeSmall organic molecule
Emp. Form.C18H15FN2S
Mol. Mass.310.389
SMILESCc1cncc(Cc2ccc(Sc3ccccc3F)nc2)c1