Reaction Details
TargetHistone deacetylase 6
LigandBDBM50239832
Substrate/Competitorn/a
Meas. Tech.ChEMBL_1667232 (CHEMBL4017028)
IC50 135±n/a nM
Citation Krieger, VHamacher, AGertzen, CGWSenger, JZwinderman, MRHMarek, MRomier, CDekker, FJKurz, TJung, MGohlke, HKassack, MUHansen, FK Design, Multicomponent Synthesis, and Anticancer Activity of a Focused Histone Deacetylase (HDAC) Inhibitor Library with Peptoid-Based Cap Groups. J Med Chem60:5493-5506 (2017) 
 
Histone deacetylase 6
Name:Histone deacetylase 6
Type:Chromatin regulator; hydrolase; repressor
Mol. Mass.:131381.51
Organism:Homo sapiens (Human)
Description:Q9UBN7
Residue:1215
BDBM50239832
NameBDBM50239832
Synonyms:CHEMBL4090647
TypeSmall organic molecule
Emp. Form.C24H31N3O4
Mol. Mass.425.5206
SMILESCc1cc(C)cc(c1)C(=O)N(CCCCCC(=O)NO)CC(=O)NCc1ccccc1