Reaction Details
TargetHistone deacetylase 2
LigandBDBM50239822
Substrate/Competitorn/a
Meas. Tech.ChEMBL_1667234 (CHEMBL4017030)
IC50 146±n/a nM
Citation Krieger, VHamacher, AGertzen, CGWSenger, JZwinderman, MRHMarek, MRomier, CDekker, FJKurz, TJung, MGohlke, HKassack, MUHansen, FK Design, Multicomponent Synthesis, and Anticancer Activity of a Focused Histone Deacetylase (HDAC) Inhibitor Library with Peptoid-Based Cap Groups. J Med Chem60:5493-5506 (2017) 
 
Histone deacetylase 2
Name:Histone deacetylase 2
Type:Chromatin regulator; hydrolase; repressor
Mol. Mass.:55356.54
Organism:Homo sapiens (Human)
Description:Q92769
Residue:488
BDBM50239822
NameBDBM50239822
Synonyms:CHEMBL4080343
TypeSmall organic molecule
Emp. Form.C24H32N4O4
Mol. Mass.440.5353
SMILESCN(C)c1ccc(cc1)C(=O)N(CCCCCC(=O)NO)CC(=O)Nc1ccc(C)cc1