Reaction Details
TargetHistone deacetylase 1
LigandBDBM50239819
Substrate/Competitorn/a
Meas. Tech.ChEMBL_1667231 (CHEMBL4017027)
IC50 27±n/a nM
Citation Krieger, VHamacher, AGertzen, CGWSenger, JZwinderman, MRHMarek, MRomier, CDekker, FJKurz, TJung, MGohlke, HKassack, MUHansen, FK Design, Multicomponent Synthesis, and Anticancer Activity of a Focused Histone Deacetylase (HDAC) Inhibitor Library with Peptoid-Based Cap Groups. J Med Chem60:5493-5506 (2017) 
 
Histone deacetylase 1
Name:Histone deacetylase 1
Type:Enzyme
Mol. Mass.:55090.27
Organism:Homo sapiens (Human)
Description:Q13547
Residue:482
BDBM50239819
NameBDBM50239819
Synonyms:CHEMBL4095934
TypeSmall organic molecule
Emp. Form.C23H35N3O4
Mol. Mass.417.5417
SMILESCc1cc(C)cc(c1)C(=O)N(CCCCCC(=O)NO)CC(=O)NC1CCCCC1