Reaction Details
TargetcGMP-dependent 3',5'-cyclic phosphodiesterase
LigandBDBM50239850
Substrate/Competitorn/a
Meas. Tech.ChEMBL_1667258 (CHEMBL4017054)
IC50 67±n/a nM
Citation Helal, CJArnold, EPBoyden, TLChang, CChappie, TAFennell, KFForman, MDHajos, MHarms, JFHoffman, WEHumphrey, JMKang, ZKleiman, RJKormos, BLLee, CWLu, JMaklad, NMcDowell, LMente, SO'Connor, REPandit, JPiotrowski, MSchmidt, AWSchmidt, CJUeno, HVerhoest, PRYang, EX Application of Structure-Based Design and Parallel Chemistry to Identify a Potent, Selective, and Brain Penetrant Phosphodiesterase 2A Inhibitor. J Med Chem60:5673-5698 (2017) 
 
cGMP-dependent 3',5'-cyclic phosphodiesterase
Name:cGMP-dependent 3',5'-cyclic phosphodiesterase
Type:Enzyme Catalytic Domain
Mol. Mass.:105691.58
Organism:Homo sapiens (Human)
Description:O00408
Residue:941
BDBM50239850
NameBDBM50239850
Synonyms:CHEMBL4095252
TypeSmall organic molecule
Emp. Form.C20H25N5O2
Mol. Mass.367.4448
SMILESCOc1ccc(OC2CN(C2)c2ncnc3n(C)nc(CC(C)C)c23)cc1