Reaction Details
TargetcGMP-dependent 3',5'-cyclic phosphodiesterase
LigandBDBM50239852
Substrate/Competitorn/a
Meas. Tech.ChEMBL_1667258 (CHEMBL4017054)
IC50 146±n/a nM
Citation Helal, CJArnold, EPBoyden, TLChang, CChappie, TAFennell, KFForman, MDHajos, MHarms, JFHoffman, WEHumphrey, JMKang, ZKleiman, RJKormos, BLLee, CWLu, JMaklad, NMcDowell, LMente, SO'Connor, REPandit, JPiotrowski, MSchmidt, AWSchmidt, CJUeno, HVerhoest, PRYang, EX Application of Structure-Based Design and Parallel Chemistry to Identify a Potent, Selective, and Brain Penetrant Phosphodiesterase 2A Inhibitor. J Med Chem60:5673-5698 (2017) 
 
cGMP-dependent 3',5'-cyclic phosphodiesterase
Name:cGMP-dependent 3',5'-cyclic phosphodiesterase
Type:Enzyme Catalytic Domain
Mol. Mass.:105691.58
Organism:Homo sapiens (Human)
Description:O00408
Residue:941
BDBM50239852
NameBDBM50239852
Synonyms:CHEMBL4073717
TypeSmall organic molecule
Emp. Form.C18H21N5
Mol. Mass.307.3928
SMILESCC(C)Cc1nn(C)c2ncnc(N3Cc4ccccc4C3)c12