Reaction Details
TargetcGMP-dependent 3',5'-cyclic phosphodiesterase
LigandBDBM130953
Substrate/Competitorn/a
Meas. Tech.ChEMBL_1667258 (CHEMBL4017054)
IC50 8.9±n/a nM
Citation Helal, CJArnold, EPBoyden, TLChang, CChappie, TAFennell, KFForman, MDHajos, MHarms, JFHoffman, WEHumphrey, JMKang, ZKleiman, RJKormos, BLLee, CWLu, JMaklad, NMcDowell, LMente, SO'Connor, REPandit, JPiotrowski, MSchmidt, AWSchmidt, CJUeno, HVerhoest, PRYang, EX Application of Structure-Based Design and Parallel Chemistry to Identify a Potent, Selective, and Brain Penetrant Phosphodiesterase 2A Inhibitor. J Med Chem60:5673-5698 (2017) 
 
cGMP-dependent 3',5'-cyclic phosphodiesterase
Name:cGMP-dependent 3',5'-cyclic phosphodiesterase
Type:Enzyme Catalytic Domain
Mol. Mass.:105691.58
Organism:Homo sapiens (Human)
Description:O00408
Residue:941
BDBM130953
NameBDBM130953
Synonyms:US8829010, 4
TypeSmall organic molecule
Emp. Form.C19H17F3N8
Mol. Mass.414.3871
SMILESCn1ncc(-c2nn(C)c3ncnc(N4CCC4)c23)c1-c1ccc(cn1)C(F)(F)F