Reaction Details
TargetcGMP-dependent 3',5'-cyclic phosphodiesterase
LigandBDBM130958
Substrate/Competitorn/a
Meas. Tech.ChEMBL_1667258 (CHEMBL4017054)
IC50 2.0±n/a nM
Citation Helal, CJArnold, EPBoyden, TLChang, CChappie, TAFennell, KFForman, MDHajos, MHarms, JFHoffman, WEHumphrey, JMKang, ZKleiman, RJKormos, BLLee, CWLu, JMaklad, NMcDowell, LMente, SO'Connor, REPandit, JPiotrowski, MSchmidt, AWSchmidt, CJUeno, HVerhoest, PRYang, EX Application of Structure-Based Design and Parallel Chemistry to Identify a Potent, Selective, and Brain Penetrant Phosphodiesterase 2A Inhibitor. J Med Chem60:5673-5698 (2017) 
 
cGMP-dependent 3',5'-cyclic phosphodiesterase
Name:cGMP-dependent 3',5'-cyclic phosphodiesterase
Type:Enzyme Catalytic Domain
Mol. Mass.:105691.58
Organism:Homo sapiens (Human)
Description:O00408
Residue:941
BDBM130958
NameBDBM130958
Synonyms:US8829010, 9
TypeSmall organic molecule
Emp. Form.C21H23N7
Mol. Mass.373.4542
SMILESCCc1ccc(cc1)-c1c(cnn1C)-c1nn(C)c2ncnc(N3CCC3)c12