Reaction Details
TargetHistone deacetylase 6
LigandBDBM50239856
Substrate/Competitorn/a
Meas. Tech.ChEMBL_1667344 (CHEMBL4017140)
IC50 52±n/a nM
Citation Stenzel, KHamacher, AHansen, FKGertzen, CGWSenger, JMarquardt, VMarek, LMarek, MRomier, CRemke, MJung, MGohlke, HKassack, MUKurz, T Alkoxyurea-Based Histone Deacetylase Inhibitors Increase Cisplatin Potency in Chemoresistant Cancer Cell Lines. J Med Chem60:5334-5348 (2017) 
 
Histone deacetylase 6
Name:Histone deacetylase 6
Type:Chromatin regulator; hydrolase; repressor
Mol. Mass.:131381.51
Organism:Homo sapiens (Human)
Description:Q9UBN7
Residue:1215
BDBM50239856
NameBDBM50239856
Synonyms:CHEMBL2311793
TypeSmall organic molecule
Emp. Form.C16H20N4O4
Mol. Mass.332.3544
SMILESONC(=O)CCCCCONC(=O)Nc1cnc2ccccc2c1