Reaction Details
TargetHistone deacetylase 4
LigandBDBM50239860
Substrate/Competitorn/a
Meas. Tech.ChEMBL_1667346 (CHEMBL4017142)
IC50 447±n/a nM
Citation Stenzel, KHamacher, AHansen, FKGertzen, CGWSenger, JMarquardt, VMarek, LMarek, MRomier, CRemke, MJung, MGohlke, HKassack, MUKurz, T Alkoxyurea-Based Histone Deacetylase Inhibitors Increase Cisplatin Potency in Chemoresistant Cancer Cell Lines. J Med Chem60:5334-5348 (2017) 
 
Histone deacetylase 4
Name:Histone deacetylase 4
Type:Enzyme
Mol. Mass.:119049.39
Organism:Homo sapiens (Human)
Description:P56524
Residue:1084
BDBM50239860
NameBDBM50239860
Synonyms:CHEMBL4081343
TypeSmall organic molecule
Emp. Form.C25H21F3N4O3S
Mol. Mass.514.519
SMILESFC(F)(F)c1nc(no1)-c1ccc(cc1)C(=O)NCC1(CCOCC1)c1cnc(s1)-c1ccccc1