Reaction Details
TargetHistone deacetylase 4
LigandBDBM50239859
Substrate/Competitorn/a
Meas. Tech.ChEMBL_1667346 (CHEMBL4017142)
IC50>10000±n/a nM
Citation Stenzel, KHamacher, AHansen, FKGertzen, CGWSenger, JMarquardt, VMarek, LMarek, MRomier, CRemke, MJung, MGohlke, HKassack, MUKurz, T Alkoxyurea-Based Histone Deacetylase Inhibitors Increase Cisplatin Potency in Chemoresistant Cancer Cell Lines. J Med Chem60:5334-5348 (2017) 
 
Histone deacetylase 4
Name:Histone deacetylase 4
Type:Enzyme
Mol. Mass.:119049.39
Organism:Homo sapiens (Human)
Description:P56524
Residue:1084
BDBM50239859
NameBDBM50239859
Synonyms:CHEMBL4088276
TypeSmall organic molecule
Emp. Form.C18H24N4O5
Mol. Mass.376.407
SMILESCOc1cc(NC(=O)NOCCCCCC(=O)NO)c2nccc(C)c2c1