Reaction Details
TargetDNA polymerase beta
LigandBDBM50020676
Substrate/Competitorn/a
Meas. Tech.ChEMBL_1667556 (CHEMBL4017352)
IC50 19000±n/a nM
Citation Zhou, SMahmoud, SLiu, PZhou, LEhteshami, MBassit, LTao, SDomaoal, RASari, OSchutter, CAmiralaei, SKhalil, AOllinger Russell, OMcBrayer, TWhitaker, TAbou-Taleb, NAmblard, FCoats, SJSchinazi, RF 2'-Chloro,2'-fluoro Ribonucleotide Prodrugs with Potent Pan-genotypic Activity against Hepatitis C Virus Replication in Culture. J Med Chem60:5424-5437 (2017) 
 
DNA polymerase beta
Name:DNA polymerase beta
Type:Protein
Mol. Mass.:38188.76
Organism:Homo sapiens (Human)
Description:n/a
Residue:335
BDBM50020676
NameBDBM50020676
Synonyms:CHEBI:41846 | CHEMBL566812
TypeSmall organic molecule
Emp. Form.C10H17N2O13P3
Mol. Mass.466.1689
SMILESCc1cn([C@H]2CC[C@@H](COP(O)(=O)OP(O)(=O)OP(O)(O)=O)O2)c(=O)[nH]c1=O