Reaction Details
TargetCytochrome P450 3A4
LigandBDBM294045
Substrate/Competitorn/a
Meas. Tech.ChEMBL_1667565 (CHEMBL4017361)
IC50 6800±n/a nM
Citation Zhou, SMahmoud, SLiu, PZhou, LEhteshami, MBassit, LTao, SDomaoal, RASari, OSchutter, CAmiralaei, SKhalil, AOllinger Russell, OMcBrayer, TWhitaker, TAbou-Taleb, NAmblard, FCoats, SJSchinazi, RF 2'-Chloro,2'-fluoro Ribonucleotide Prodrugs with Potent Pan-genotypic Activity against Hepatitis C Virus Replication in Culture. J Med Chem60:5424-5437 (2017) 
 
Cytochrome P450 3A4
Name:Cytochrome P450 3A4
Type:Enzyme
Mol. Mass.:57349.57
Organism:Homo sapiens (Human)
Description:n/a
Residue:503
BDBM294045
NameBDBM294045
Synonyms:US10106571, Example 2 | US10106571, Example 23
TypeSmall organic molecule
Emp. Form.C21H26ClFN3O9P
Mol. Mass.549.871
SMILESCC(C)OC(=O)[C@H](C)NP(=O)(OC[C@H]1O[C@@H](n2ccc(=O)[nH]c2=O)[C@@](F)(Cl)[C@@H]1O)Oc1ccccc1