Reaction Details
TargetCollagenase 3
LigandBDBM50239957
Substrate/Competitorn/a
Meas. Tech.ChEMBL_1667602 (CHEMBL4017398)
IC50 1.6±n/a nM
Citation Choi, JYFuerst, RKnapinska, AMTaylor, ABSmith, LCao, XHart, PJFields, GBRoush, WR Structure-Based Design and Synthesis of Potent and Selective Matrix Metalloproteinase 13 Inhibitors. J Med Chem60:5816-5825 (2017) 
 
Collagenase 3
Name:Collagenase 3
Type:Enzyme
Mol. Mass.:53808.06
Organism:Homo sapiens (Human)
Description:P45452
Residue:471
BDBM50239957
NameBDBM50239957
Synonyms:CHEMBL4089861
TypeSmall organic molecule
Emp. Form.C22H21N3O5S2
Mol. Mass.471.549
SMILESOC(=O)CNS(=O)(=O)c1ccc(cc1)-c1ccc(CSc2nc3CCCc3c(=O)[nH]2)cc1