Reaction Details
TargetCollagenase 3
LigandBDBM50239955
Substrate/Competitorn/a
Meas. Tech.ChEMBL_1667602 (CHEMBL4017398)
IC50 159±n/a nM
Citation Choi, JYFuerst, RKnapinska, AMTaylor, ABSmith, LCao, XHart, PJFields, GBRoush, WR Structure-Based Design and Synthesis of Potent and Selective Matrix Metalloproteinase 13 Inhibitors. J Med Chem60:5816-5825 (2017) 
 
Collagenase 3
Name:Collagenase 3
Type:Enzyme
Mol. Mass.:53808.06
Organism:Homo sapiens (Human)
Description:P45452
Residue:471
BDBM50239955
NameBDBM50239955
Synonyms:CHEMBL4060150
TypeSmall organic molecule
Emp. Form.C28H31FN4O4S
Mol. Mass.538.634
SMILESCNC(=O)[C@H](NC(=O)c1ccc(o1)-c1ccc(CSc2nc3CCCc3c(=O)[nH]2)c(F)c1)C1CCCCC1