Reaction Details
TargetBile salt export pump
LigandBDBM50105838
Substrate/Competitorn/a
Meas. Tech.ChEMBL_1667662 (CHEMBL4017550)
IC50>1000000±n/a nM
Citation Warner, DJChen, HCantin, LDKenna, JGStahl, SWalker, CLNoeske, T Mitigating the inhibition of human bile salt export pump by drugs: opportunities provided by physicochemical property modulation, in silico modeling, and structural modification. Drug Metab Dispos40:2332-41 (2012) 
 
Bile salt export pump
Name:Bile salt export pump
Type:Protein
Mol. Mass.:146405.49
Organism:Homo sapiens (Human)
Description:O95342
Residue:1321
BDBM50105838
NameBDBM50105838
Synonyms:FENOBAM
TypeSmall organic molecule
Emp. Form.C11H11ClN4O2
Mol. Mass.266.684
SMILESCN1CC(=O)N=C1NC(=O)Nc1cccc(Cl)c1