Reaction Details
TargetBile salt export pump
LigandBDBM78434
Substrate/Competitorn/a
Meas. Tech.ChEMBL_1667662 (CHEMBL4017550)
IC50<10000±n/a nM
Citation Warner, DJChen, HCantin, LDKenna, JGStahl, SWalker, CLNoeske, T Mitigating the inhibition of human bile salt export pump by drugs: opportunities provided by physicochemical property modulation, in silico modeling, and structural modification. Drug Metab Dispos40:2332-41 (2012) 
 
Bile salt export pump
Name:Bile salt export pump
Type:Protein
Mol. Mass.:146405.49
Organism:Homo sapiens (Human)
Description:O95342
Residue:1321
BDBM78434
NameBDBM78434
Synonyms:2-chloranyl-10-[3-(4-methylpiperazin-1-yl)propyl]phenothiazine;ethane-1,2-disulfonic acid 2-chloro-10-[3-(4-methylpiperazin-1-yl)propyl]phenothiazine;ethane-1,2-disulfonic acid Compazine MLS001148133 SMR000653454 | cid_91499
TypeSmall organic molecule
Emp. Form.C20H24ClN3S
Mol. Mass.373.943
SMILESCN1CCN(CCCN2c3ccccc3Sc3ccc(Cl)cc23)CC1