Reaction Details
TargetBile salt export pump
LigandBDBM50222218
Substrate/Competitorn/a
Meas. Tech.ChEMBL_1667662 (CHEMBL4017550)
IC50 46820±n/a nM
Citation Warner, DJChen, HCantin, LDKenna, JGStahl, SWalker, CLNoeske, T Mitigating the inhibition of human bile salt export pump by drugs: opportunities provided by physicochemical property modulation, in silico modeling, and structural modification. Drug Metab Dispos40:2332-41 (2012) 
 
Bile salt export pump
Name:Bile salt export pump
Type:Protein
Mol. Mass.:146405.49
Organism:Homo sapiens (Human)
Description:O95342
Residue:1321
BDBM50222218
NameBDBM50222218
Synonyms:CHEBI:51137 | Mianserin
TypeSmall organic molecule
Emp. Form.C18H20N2
Mol. Mass.264.3648
SMILESCN1CCN2C(C1)c1ccccc1Cc1ccccc21