Reaction Details
TargetP2Y purinoceptor 12
LigandBDBM50000334
Substrate/Competitorn/a
Meas. Tech.ChEBML_162869
EC50 1050±n/a nM
Citation Meanwell, NAPearce, BCRoth, HRSmith, ECWedding, DLWright, JJBuchanan, JOBaryla, UMGamberdella, MGillespie, E Inhibitors of blood platelet cAMP phosphodiesterase. 2. Structure-activity relationships associated with 1,3-dihydro-2H-imidazo[4,5-b]quinolin-2-ones substituted with functionalized side chains. J Med Chem35:2672-87 (1992) P2Y purinoceptor 12
Name:P2Y purinoceptor 12
Type:Enzyme
Mol. Mass.:39458.48
Organism:Homo sapiens (Human)
Description:Q9H244
Residue:342
BDBM50000334
NameBDBM50000334
Synonyms:6,7-Dichloro-1,5-dihydro-imidazo[2,1-b]quinazolin-2-one 6,7-Dichloro-1,5-dihydro-imidazo[2,1-b]quinazolin-2-one(anagrelide) Agrylin | CHEMBL760
TypeSmall organic molecule
Emp. Form.C10H7Cl2N3O
Mol. Mass.256.088
SMILESClc1ccc2N=C3NC(=O)CN3Cc2c1Cl